{"text_format":"1","workbook":"xlsx","n_sheets":15,"sheets":["Instructions","Humorous Monologues","HumorousMR","Dramatic","DramaticMR","Classical","ClassicalMR","Contemporary","ContemporaryMR","Pantomime","PantomimeMR","MusicalTheatre","MusicalTheatreMR","One-Acts","Sweepstakes"],"not_rendered":{"charts":0,"images":0,"macros":1,"external_links":0,"defined_names":0,"comments":0,"pivot_tables":0},"unopened":[],"bounds":{"document_bytes":16777216,"sheet_cells":100000,"rows_first":2000,"rows_last":500,"rows_between":2000,"halvings":0,"cell_chars":16384,"cell_head_chars":4096},"cells_cut":0,"cells_raw":0,"read":"whole","date_system":"1900"}

{"sheet":"Instructions","index":0,"n_rows":26,"n_cols":1,"rows_kept":26,"cut":false,"hidden":false,"merged":[]}
["Directions for Using the UHSAA SCORING SPREADSHEET"]
["for Region and State Theatre Meets:"]
[]
["If you have any questions, please email Giselle Gremmert at giselle.gremmert@canyonsdistrict.org"]
["If there is an emergency the day of your meet, feel free to call or text at 785-580-7379"]
[]
{"$rows_left_out":21}
{"sheet":"Humorous Monologues","index":1,"n_rows":152,"n_cols":33,"rows_kept":152,"cut":false,"hidden":false,"merged":[[0,0,0,8]]}
["Humorous Monologues",null,null,null,null,null,null,null,null,null,"Rank 1-4",null,null,null,null,null,null,null,null,null,null,null,null,"S","E","G","F",null,"1violation","2violations","3violations"]
[null,null,null,null,null,null,null,null,null,null,"Round 1:",null,"Round 2:",null,"Round 3:",null,"-2 for each",null,null,null,null,null,null,null,null,null,null,"Drops lowest from column q"]
[null,null,null,null,null,null,null,"Student Name",null,"Title of Piece","R1 rank","R1 score","R2 rank","R2 score","R3 rank","R3 score","Time Violations",null,"TOTAL SCORE",null,"TOTAL RANK",null,null,"TOTAL SCHOOL SWEEPS POINTS",null,null,null,"Drop Lowest"]
["A-101",null,null,null,null,null,null,"(410) Sarah B.",null,"\"Trapped in..\"",2,25,1,23,1,23,null,{"$f":"IF(Q4=\"1violation\",-7*1,IF(Q4=\"2violations\",-7*2,IF(Q4=\"3violations\",-7*3,IF(Q4=\"\",\"\"))))","v":""},{"$f":"SUM(L4,N4,P4,R4)","v":71},null,{"$f":"SUM(K4,M4,O4)","v":4},null,null,null,{"$f":"SUM(S4,S6,S5,S7,-AB4)","v":199},null,null,{"$f":"MIN(S4:S7)","v":50}]
["A-102",null,null,null,null,null,null,"(411) Katrina",null,"\"Ate Them!\"",2,17,4,16,3,17,null,{"$f":"IF(Q5=\"1violation\",-7*1,IF(Q5=\"2violations\",-7*2,IF(Q5=\"3violations\",-7*3,IF(Q5=\"\",\"\"))))","v":""},{"$f":"SUM(L5,N5,P5,R5)","v":50},null,{"$f":"SUM(K5,M5,O5)","v":9}]
["A-103",null,null,null,null,null,null,"(412) Maryam",null,"\"Call Me Dumper\"",4,21,3,18,3,22,null,{"$f":"IF(Q6=\"1violation\",-7*1,IF(Q6=\"2violations\",-7*2,IF(Q6=\"3violations\",-7*3,IF(Q6=\"\",\"\"))))","v":""},{"$f":"SUM(L6,N6,P6,R6)","v":61},null,{"$f":"SUM(K6,M6,O6)","v":10}]
{"$rows_left_out":147}
{"sheet":"HumorousMR","index":2,"n_rows":122,"n_cols":14,"rows_kept":122,"cut":false,"hidden":false,"merged":[]}
["Humorous",null,null,null,null,"Finals Medals Round Scores"]
["ID","Column1","Rank","Score","LeaveBlank","MR 1 Rank","MR 1 Score","MR2 Rank","MR 2 Score","MR3 Rank","MR 3 Score","Total MR Rank","Total MR Score","Column2"]
[{"$f":"'Humorous Monologues'!A14","v":"C-101"},{"$f":"VLOOKUP(Table7[[#This Row],[ID]],'Humorous Monologues'!A:H,8,FALSE)","v":"(407) Katie Wilson"},{"$f":"'Humorous Monologues'!U14","v":3},{"$f":"'Humorous Monologues'!S14","v":69},{"$f":"IF((Table7[[#This Row],[Rank]]+Table7[[#This Row],[Score]])>0,1,0)","v":1},1,25,1,24,2,25,{"$f":"SUM(F3,H3,J3)","v":4},{"$f":"SUM(G3,I3,K3)","v":74},"1st"]
[{"$f":"'Humorous Monologues'!A4","v":"A-101"},{"$f":"VLOOKUP(Table7[[#This Row],[ID]],'Humorous Monologues'!A:H,8,FALSE)","v":"(410) Sarah B."},{"$f":"'Humorous Monologues'!U4","v":4},{"$f":"'Humorous Monologues'!S4","v":71},{"$f":"IF((Table7[[#This Row],[Rank]]+Table7[[#This Row],[Score]])>0,1,0)","v":1},3,24,2,24,3,25,8,73,"2nd"]
[{"$f":"'Humorous Monologues'!A10","v":"B-102"},{"$f":"VLOOKUP(Table7[[#This Row],[ID]],'Humorous Monologues'!A:H,8,FALSE)","v":"(401) Elise Sarols"},{"$f":"'Humorous Monologues'!U10","v":5},{"$f":"'Humorous Monologues'!S10","v":72},{"$f":"IF((Table7[[#This Row],[Rank]]+Table7[[#This Row],[Score]])>0,1,0)","v":1},3,23,4,24,1,25,8,72,"3rd"]
[{"$f":"'Humorous Monologues'!A24","v":"E-101"},{"$f":"VLOOKUP(Table7[[#This Row],[ID]],'Humorous Monologues'!A:H,8,FALSE)","v":"(403) Josh Larmore"},{"$f":"'Humorous Monologues'!U24","v":5},{"$f":"'Humorous Monologues'!S24","v":65},{"$f":"IF((Table7[[#This Row],[Rank]]+Table7[[#This Row],[Score]])>0,1,0)","v":1},5,19,5,22,4,24,14,65]
{"$rows_left_out":117}
{"sheet":"Dramatic","index":3,"n_rows":152,"n_cols":31,"rows_kept":152,"cut":false,"hidden":false,"merged":[[0,0,0,8]]}
["Dramatic Monologues",null,null,null,null,null,null,null,null,null,"Rank 1-4",null,null,null,null,null,null,null,null,null,null,null,null,"S","E","G","F",null,"1violation","2violations","3violations"]
[null,null,null,null,null,null,null,null,null,null,"Round 1:",null,"Round 2:",null,"Round 3:",null,"-2 for each",null,null,null,null,null,null,null,null,null,null,"Drops lowest from column q"]
[null,null,null,null,null,null,null,"Student Name",null,"Title of Piece","R1 rank","R1 score","R2 rank","R2 score","R3 rank","R3 score","Time Violations",null,"TOTAL SCORE",null,"TOTAL RANK",null,null,"TOTAL SCHOOL SWEEPS POINTS",null,null,null,"Drop Lowest"]
["A-201",null,null,null,null,null,null,"(503) Cole B.",null,"\"Lord of the Rings\"",4,18,4,21,4,22,null,{"$f":"IF(Q4=\"1violation\",-7*1,IF(Q4=\"2violations\",-7*2,IF(Q4=\"3violations\",-7*3,IF(Q4=\"\",\"\"))))","v":""},{"$f":"SUM(L4,N4,P4,R4)","v":61},null,{"$f":"SUM(K4,M4,O4)","v":12},null,null,null,{"$f":"SUM(S4,S6,S5,S7,-AB4)","v":204},null,null,{"$f":"MIN(S4:S7)","v":58}]
["A-202",null,null,null,null,null,null,"(504) Mary C.",null,"\"Bluebirds\"",1,25,1,25,2,25,null,{"$f":"IF(Q5=\"1violation\",-7*1,IF(Q5=\"2violations\",-7*2,IF(Q5=\"3violations\",-7*3,IF(Q5=\"\",\"\"))))","v":""},{"$f":"SUM(L5,N5,P5,R5)","v":75},null,{"$f":"SUM(K5,M5,O5)","v":4}]
["A-203",null,null,null,null,null,null,"(505) Melissa P.",null,"\"Come, Stay, Go\"",4,14,4,20,4,24,null,"",{"$f":"SUM(L6,N6,P6,R6)","v":58},null,{"$f":"SUM(K6,M6,O6)","v":12}]
{"$rows_left_out":147}
{"sheet":"DramaticMR","index":4,"n_rows":122,"n_cols":14,"rows_kept":122,"cut":false,"hidden":false,"merged":[]}
["Dramatic",null,null,null,null,"Finals Medals Round Scores"]
["ID","Column1","Rank","Score","LeaveBlank","MR 1 Rank","MR 1 Score","MR2 Rank","MR 2 Score","MR3 Rank","MR 3 Score","Total MR Rank","Total MR Score","Column2"]
[{"$f":"Dramatic!A5","v":"A-202"},{"$f":"VLOOKUP(Table710[[#This Row],[ID]],Dramatic!A:H,8,FALSE)","v":"(504) Mary C."},{"$f":"Dramatic!U5","v":4},{"$f":"Dramatic!S5","v":75},{"$f":"IF((Table710[[#This Row],[Rank]]+Table710[[#This Row],[Score]])>0,1,0)","v":1},1,25,1,25,1,25,{"$f":"SUM(F3,H3,J3)","v":3},{"$f":"SUM(G3,I3,K3)","v":75},"1st"]
[{"$f":"Dramatic!A19","v":"D-201"},{"$f":"VLOOKUP(Table710[[#This Row],[ID]],Dramatic!A:H,8,FALSE)","v":"(507) Mary Anderson"},{"$f":"Dramatic!U19","v":4},{"$f":"Dramatic!S19","v":74},{"$f":"IF((Table710[[#This Row],[Rank]]+Table710[[#This Row],[Score]])>0,1,0)","v":1},2,25,3,23,2,24,{"$f":"SUM(F4,H4,J4)","v":7},{"$f":"SUM(G4,I4,K4)","v":72},"2nd"]
[{"$f":"Dramatic!A9","v":"B-201"},{"$f":"VLOOKUP(Table710[[#This Row],[ID]],Dramatic!A:H,8,FALSE)","v":"(500) Jaren Henrie"},{"$f":"Dramatic!U9","v":5},{"$f":"Dramatic!S9","v":69},{"$f":"IF((Table710[[#This Row],[Rank]]+Table710[[#This Row],[Score]])>0,1,0)","v":1},4,24,4,23,5,21,{"$f":"SUM(F5,H5,J5)","v":13},{"$f":"SUM(G5,I5,K5)","v":68}]
[{"$f":"Dramatic!A11","v":"B-203"},{"$f":"VLOOKUP(Table710[[#This Row],[ID]],Dramatic!A:H,8,FALSE)","v":"(502) Kam Petsche"},{"$f":"Dramatic!U11","v":7},{"$f":"Dramatic!S11","v":72},{"$f":"IF((Table710[[#This Row],[Rank]]+Table710[[#This Row],[Score]])>0,1,0)","v":1},3,24,2,24,3,23,{"$f":"SUM(F6,H6,J6)","v":8},{"$f":"SUM(G6,I6,K6)","v":71},"3rd"]
{"$rows_left_out":117}
{"sheet":"Classical","index":5,"n_rows":152,"n_cols":31,"rows_kept":152,"cut":false,"hidden":false,"merged":[]}
["Classical Scenes",null,null,null,null,null,null,null,null,null,"Rank 1-4",null,null,null,null,null,null,null,null,null,null,null,null,"S","E","G","F",null,"1violation","2violations","3violations"]
[null,null,null,null,null,null,null,null,null,null,"Round 1:",null,"Round 2:",null,"Round 3:",null,"-2 for each",null,null,null,null,null,null,null,null,null,null,"Drops lowest from column q"]
[null,null,null,"Student Name",null,"Student Name",null,"Student Name",null,"Title of Piece","R1 rank","R1 score","R2 rank","R2 score","R3 rank","R3 score","Time Violations",null,"TOTAL SCORE",null,"TOTAL RANK",null,null,"TOTAL SCHOOL SWEEPS POINTS",null,null,null,"Drop Lowest"]
["A-301",null,null,"(202) Anthony A.",null,"Ryan B.",null,null,null,"\"Cyrano De Bergerac\"",3,20,3,23,4,18,null,{"$f":"IF(Q4=\"1violation\",-7*1,IF(Q4=\"2violations\",-7*2,IF(Q4=\"3violations\",-7*3,IF(Q4=\"\",\"\"))))","v":""},{"$f":"SUM(L4,N4,P4,R4)","v":61},null,{"$f":"SUM(K4,M4,O4)","v":10},null,null,null,{"$f":"SUM(S4,S6,S5,S7,-AB4)","v":185},null,null,{"$f":"MIN(S4:S7)","v":52}]
["A-302",null,null,"(203) Jackson P.",null,"Noah W.",null,null,null,"\"Two Gentlemen\"",1,24,2,24,2,21,null,{"$f":"IF(Q5=\"1violation\",-7*1,IF(Q5=\"2violations\",-7*2,IF(Q5=\"3violations\",-7*3,IF(Q5=\"\",\"\"))))","v":""},{"$f":"SUM(L5,N5,P5,R5)","v":69},null,{"$f":"SUM(K5,M5,O5)","v":5}]
["A-303",null,null,"(205) Brinley",null,"Charlie",null,null,null,"\"Much Ado\"",4,16,4,19,3,20,null,"",{"$f":"SUM(L6,N6,P6,R6)","v":55},null,{"$f":"SUM(K6,M6,O6)","v":11}]
{"$rows_left_out":147}
{"sheet":"ClassicalMR","index":6,"n_rows":122,"n_cols":14,"rows_kept":122,"cut":false,"hidden":false,"merged":[]}
["Classical",null,null,null,null,"Finals Medals Round Scores"]
["ID","Column1","Rank","Score","LeaveBlank","MR 1 Rank","MR 1 Score","MR2 Rank","MR 2 Score","MR3 Rank","MR 3 Score","Total MR Rank","Total MR Score","Column2"]
[{"$f":"Classical!A10","v":"B-302"},{"$f":"VLOOKUP(Table71012[[#This Row],[ID]],Classical!A:D,4,FALSE)","v":"(201) Haley Coombs"},{"$f":"Classical!U10","v":4},{"$f":"Classical!S10","v":73},{"$f":"IF((Table71012[[#This Row],[Rank]]+Table71012[[#This Row],[Score]])>0,1,0)","v":1},null,null,null,null,null,null,{"$f":"SUM(F3,H3,J3)","v":0},{"$f":"SUM(G3,I3,K3)","v":0},"1st"]
[{"$f":"Classical!A5","v":"A-302"},{"$f":"VLOOKUP(Table71012[[#This Row],[ID]],Classical!A:D,4,FALSE)","v":"(203) Jackson P."},{"$f":"Classical!U5","v":5},{"$f":"Classical!S5","v":69},{"$f":"IF((Table71012[[#This Row],[Rank]]+Table71012[[#This Row],[Score]])>0,1,0)","v":1},null,null,null,null,null,null,0,0,"2nd"]
[{"$f":"Classical!A4","v":"A-301"},{"$f":"VLOOKUP(Table71012[[#This Row],[ID]],Classical!A:D,4,FALSE)","v":"(202) Anthony A."},{"$f":"Classical!U4","v":10},{"$f":"Classical!S4","v":61},{"$f":"IF((Table71012[[#This Row],[Rank]]+Table71012[[#This Row],[Score]])>0,1,0)","v":1},null,null,null,null,null,null,0,0,"3rd"]
[{"$f":"Classical!A6","v":"A-303"},{"$f":"VLOOKUP(Table71012[[#This Row],[ID]],Classical!A:D,4,FALSE)","v":"(205) Brinley"},{"$f":"Classical!U6","v":11},{"$f":"Classical!S6","v":55},{"$f":"IF((Table71012[[#This Row],[Rank]]+Table71012[[#This Row],[Score]])>0,1,0)","v":1},null,null,null,null,null,null,0,0]
{"$rows_left_out":117}
{"sheet":"Contemporary","index":7,"n_rows":152,"n_cols":31,"rows_kept":152,"cut":false,"hidden":false,"merged":[]}
["Contemporary Scenes",null,null,null,null,null,null,null,null,null,"Rank 1-4",null,null,null,null,null,null,null,null,null,null,null,null,"S","E","G","F",null,"1violation","2violations","3violations"]
[null,null,null,null,null,null,null,null,null,null,"Round 1:",null,"Round 2:",null,"Round 3:",null,"-2 for each",null,null,null,null,null,null,null,null,null,null,"Drops lowest from column q"]
[null,null,null,"Student Name",null,"Student Name",null,"Student Name",null,"Title of Piece","R1 rank","R1 score","R2 rank","R2 score","R3 rank","R3 score","Time Violations",null,"TOTAL SCORE",null,"TOTAL RANK",null,null,"TOTAL SCHOOL SWEEPS POINTS",null,null,null,"Drop Lowest"]
["A-401",null,null,"(306) Andy G.",null,"Zach H.",null,"Dom Y.",null,"\"Pep Apocalyse\"",3,20,4,23,3,18,null,{"$f":"IF(Q4=\"1violation\",-7*1,IF(Q4=\"2violations\",-7*2,IF(Q4=\"3violations\",-7*3,IF(Q4=\"\",\"\"))))","v":""},{"$f":"SUM(L4,N4,P4,R4)","v":61},null,{"$f":"SUM(K4,M4,O4)","v":10},null,null,null,{"$f":"SUM(S4,S6,S5,S7,-AB4)","v":186},null,null,{"$f":"MIN(S4:S7)","v":59}]
["A-402",null,null,"(307) Ella ",null,"Riley C.",null,null,null,"\"Anti-Social\"",2,20,3,24,4,18,null,{"$f":"IF(Q5=\"1violation\",-7*1,IF(Q5=\"2violations\",-7*2,IF(Q5=\"3violations\",-7*3,IF(Q5=\"\",\"\"))))","v":""},{"$f":"SUM(L5,N5,P5,R5)","v":62},null,{"$f":"SUM(K5,M5,O5)","v":9}]
["A-403",null,null,"(308) Tristan",null,"George M.",null,"Joey R.",null,"\"Dubuque 911\"",1,22,4,18,1,23,null,"",{"$f":"SUM(L6,N6,P6,R6)","v":63},null,{"$f":"SUM(K6,M6,O6)","v":6}]
{"$rows_left_out":147}
{"sheet":"ContemporaryMR","index":8,"n_rows":122,"n_cols":14,"rows_kept":122,"cut":false,"hidden":false,"merged":[]}
["Contemporary ",null,0,null,null,"Finals Medals Round Scores"]
["ID","Column1","Rank","Score","LeaveBlank","MR 1 Rank","MR 1 Score","MR2 Rank","MR 2 Score","MR3 Rank","MR 3 Score","Total MR Rank","Total MR Score","Column2"]
[{"$f":"Contemporary!A39","v":"H-401"},{"$f":"VLOOKUP(Table7101213[[#This Row],[ID]],Contemporary!A:D,4,FALSE)","v":"(313) Kara Conrad"},{"$f":"Contemporary!U39","v":3},{"$f":"Contemporary!S39","v":70},{"$f":"IF((Table7101213[[#This Row],[Rank]]+Table7101213[[#This Row],[Score]])>0,1,0)","v":1},3,23,4,23,6,19,{"$f":"SUM(F3,H3,J3)","v":13},{"$f":"SUM(G3,I3,K3)","v":65}]
[{"$f":"Contemporary!A44","v":"J-401"},{"$f":"VLOOKUP(Table7101213[[#This Row],[ID]],Contemporary!A:D,4,FALSE)","v":"(304) Kelby Jessen"},{"$f":"Contemporary!U44","v":5},{"$f":"Contemporary!S44","v":72},{"$f":"IF((Table7101213[[#This Row],[Rank]]+Table7101213[[#This Row],[Score]])>0,1,0)","v":1},1,25,2,25,1,24,{"$f":"SUM(F4,H4,J4)","v":4},{"$f":"SUM(G4,I4,K4)","v":74},"1st"]
[{"$f":"Contemporary!A20","v":"D-402"},{"$f":"VLOOKUP(Table7101213[[#This Row],[ID]],Contemporary!A:D,4,FALSE)","v":"(310) Talesha Bills"},{"$f":"Contemporary!U20","v":6},{"$f":"Contemporary!S20","v":65},{"$f":"IF((Table7101213[[#This Row],[Rank]]+Table7101213[[#This Row],[Score]])>0,1,0)","v":1},4,22,5,23,5,19,{"$f":"SUM(F5,H5,J5)","v":14},{"$f":"SUM(G5,I5,K5)","v":64}]
[{"$f":"Contemporary!A6","v":"A-403"},{"$f":"VLOOKUP(Table7101213[[#This Row],[ID]],Contemporary!A:D,4,FALSE)","v":"(308) Tristan"},{"$f":"Contemporary!U6","v":6},{"$f":"Contemporary!S6","v":63},{"$f":"IF((Table7101213[[#This Row],[Rank]]+Table7101213[[#This Row],[Score]])>0,1,0)","v":1},2,25,1,25,2,23,{"$f":"SUM(F6,H6,J6)","v":5},{"$f":"SUM(G6,I6,K6)","v":73},"2nd"]
{"$rows_left_out":117}
{"sheet":"Pantomime","index":9,"n_rows":152,"n_cols":31,"rows_kept":152,"cut":false,"hidden":false,"merged":[]}
["Pantomimes",null,null,null,null,null,null,null,null,null,"Rank 1-4",null,null,null,null,null,null,null,null,null,null,null,null,"S","E","G","F",null,"1violation","2violations","3violations"]
[null,null,null,null,null,null,null,null,null,null,"Round 1:",null,"Round 2:",null,"Round 3:",null,"-2 for each",null,null,null,null,null,null,null,null,null,null,"Drops lowest from column q"]
[null,null,null,null,null,"Student Name",null,"Student Name",null,"Title of Piece","R1 rank","R1 score","R2 rank","R2 score","R3 rank","R3 score","Time Violations",null,"TOTAL SCORE",null,"TOTAL RANK",null,null,"TOTAL SCHOOL SWEEPS POINTS",null,null,null,"Drop Lowest"]
["A-501",null,null,null,null,"(606) Dom L",null,"Dom D",null,"\"Heist\"",3,18,4,20,4,20,null,{"$f":"IF(Q4=\"1violation\",-7*1,IF(Q4=\"2violations\",-7*2,IF(Q4=\"3violations\",-7*3,IF(Q4=\"\",\"\"))))","v":""},{"$f":"SUM(L4,N4,P4,R4)","v":58},null,{"$f":"SUM(K4,M4,O4)","v":11},null,null,null,{"$f":"SUM(S4,S6,S5,S7,-AB4)","v":203},null,null,{"$f":"MIN(S4:S7)","v":58}]
["A-502",null,null,null,null,"(607) Leslie",null,"Kate",null,"\"Moms Away\"",2,23,2,22,1,23,null,{"$f":"IF(Q5=\"1violation\",-7*1,IF(Q5=\"2violations\",-7*2,IF(Q5=\"3violations\",-7*3,IF(Q5=\"\",\"\"))))","v":""},{"$f":"SUM(L5,N5,P5,R5)","v":68},null,{"$f":"SUM(K5,M5,O5)","v":5}]
["A-503",null,null,null,null,"(608) Tyler P.",null,null,null,"\"Pizza & Bar\"",1,22,2,23,4,21,null,"",{"$f":"SUM(L6,N6,P6,R6)","v":66},null,{"$f":"SUM(K6,M6,O6)","v":7}]
{"$rows_left_out":147}
{"sheet":"PantomimeMR","index":10,"n_rows":122,"n_cols":14,"rows_kept":122,"cut":false,"hidden":false,"merged":[]}
["Pantomime",null,null,null,null,"Finals Medals Round Scores"]
["ID","Column1","Rank","Score","LeaveBlank","MR 1 Rank","MR 1 Score","MR2 Rank","MR 2 Score","MR3 Rank","MR 3 Score","Total MR Rank","Total MR Score","Column2"]
[{"$f":"Pantomime!A14","v":"C-501"},{"$f":"VLOOKUP(Table710121314[[#This Row],[ID]],Pantomime!A:F,6,FALSE)","v":"(605) Jackie Leavitt"},{"$f":"Pantomime!U14","v":5},{"$f":"Pantomime!S14","v":70},{"$f":"IF((Table710121314[[#This Row],[Rank]]+Table710121314[[#This Row],[Score]])>0,1,0)","v":1},1,24,2,24,2,22,{"$f":"SUM(F3,H3,J3)","v":5},{"$f":"SUM(G3,I3,K3)","v":70},"2nd"]
[{"$f":"Pantomime!A5","v":"A-502"},{"$f":"VLOOKUP(Table710121314[[#This Row],[ID]],Pantomime!A:F,6,FALSE)","v":"(607) Leslie"},{"$f":"Pantomime!U5","v":5},{"$f":"Pantomime!S5","v":68},{"$f":"IF((Table710121314[[#This Row],[Rank]]+Table710121314[[#This Row],[Score]])>0,1,0)","v":1},3,20,3,20,3,22,{"$f":"SUM(F4,H4,J4)","v":9},{"$f":"SUM(G4,I4,K4)","v":62},"3rd"]
[{"$f":"Pantomime!A7","v":"A-504"},{"$f":"VLOOKUP(Table710121314[[#This Row],[ID]],Pantomime!A:F,6,FALSE)","v":"(609) Marcus P"},{"$f":"Pantomime!U7","v":7},{"$f":"Pantomime!S7","v":69},{"$f":"IF((Table710121314[[#This Row],[Rank]]+Table710121314[[#This Row],[Score]])>0,1,0)","v":1},4,20,4,19,4,21,{"$f":"SUM(F5,H5,J5)","v":12},{"$f":"SUM(G5,I5,K5)","v":60}]
[{"$f":"Pantomime!A29","v":"F-501"},{"$f":"VLOOKUP(Table710121314[[#This Row],[ID]],Pantomime!A:F,6,FALSE)","v":"(603) Gannon Murphy"},{"$f":"Pantomime!U29","v":7},{"$f":"Pantomime!S29","v":68},{"$f":"IF((Table710121314[[#This Row],[Rank]]+Table710121314[[#This Row],[Score]])>0,1,0)","v":1},2,23,1,24,1,23,{"$f":"SUM(F6,H6,J6)","v":4},{"$f":"SUM(G6,I6,K6)","v":70},"1st"]
{"$rows_left_out":117}
{"sheet":"MusicalTheatre","index":11,"n_rows":152,"n_cols":31,"rows_kept":152,"cut":false,"hidden":false,"merged":[]}
["Musical Theatre",null,null,null,null,null,null,null,null,null,"Rank 1-4",null,null,null,null,null,null,null,null,null,null,null,null,"S","E","G","F",null,"1violation","2violations","3violations"]
[null,null,null,null,null,null,null,null,null,null,"Round 1:",null,"Round 2:",null,"Round 3:",null,"-2 for each",null,null,null,null,null,null,null,null,null,null,"Drops lowest from column q"]
[null,"Student Name",null,"Student Name",null,"Student Name",null,"Student Name",null,"Title of Piece","R1 rank","R1 score","R2 rank","R2 score","R3 rank","R3 score","Time Violations",null,"TOTAL SCORE",null,"TOTAL RANK",null,null,"TOTAL SCHOOL SWEEPS POINTS",null,null,null,"Drop Lowest"]
["A-601","(711) Mary C.",null,null,null,null,null,null,null,"\"When He Sees Me\"",2,25,2,25,3,20,null,{"$f":"IF(Q4=\"1violation\",-7*1,IF(Q4=\"2violations\",-7*2,IF(Q4=\"3violations\",-7*3,IF(Q4=\"\",\"\"))))","v":""},{"$f":"SUM(L4,N4,P4,R4)","v":70},null,{"$f":"SUM(K4,M4,O4)","v":7},null,null,null,{"$f":"SUM(S4,S6,S5,S7,-AB4)","v":200},null,null,{"$f":"MIN(S4:S7)","v":0}]
["A-602","(712) Marcus P.",null,null,null,null,null,null,null,"\"Where is Love\"",2,24,1,23,4,21,null,{"$f":"IF(Q5=\"1violation\",-7*1,IF(Q5=\"2violations\",-7*2,IF(Q5=\"3violations\",-7*3,IF(Q5=\"\",\"\"))))","v":""},{"$f":"SUM(L5,N5,P5,R5)","v":68},null,{"$f":"SUM(K5,M5,O5)","v":7}]
["A-603","(713) Sarah B.",null,null,null,null,null,null,null,"\"Always the Bridesmaid\"",3,22,4,17,4,23,null,"",{"$f":"SUM(L6,N6,P6,R6)","v":62},null,{"$f":"SUM(K6,M6,O6)","v":11}]
{"$rows_left_out":147}
{"sheet":"MusicalTheatreMR","index":12,"n_rows":122,"n_cols":14,"rows_kept":122,"cut":false,"hidden":false,"merged":[]}
["Musical Theatre",null,null,null,null,"Finals Medals Round Scores"]
["ID","Column1","Rank","Score","LeaveBlank","MR 1 Rank","MR 1 Score","MR2 Rank","MR 2 Score","MR3 Rank","MR 3 Score","Total MR Rank","Total MR Score","Column2"]
[{"$f":"MusicalTheatre!A12","v":"B-604"},{"$f":"VLOOKUP(Table71012131415[[#This Row],[ID]],MusicalTheatre!A:B,2, FALSE)","v":"(703) Kam Petsche"},{"$f":"MusicalTheatre!U12","v":3},{"$f":"MusicalTheatre!S12","v":75},{"$f":"IF((Table71012131415[[#This Row],[Rank]]+Table71012131415[[#This Row],[Score]])>0,1,0)","v":1},1,24,3,25,4,23,{"$f":"SUM(F3,H3,J3)","v":8},{"$f":"SUM(G3,I3,K3)","v":72},"2nd"]
[{"$f":"MusicalTheatre!A21","v":"D-603"},{"$f":"VLOOKUP(Table71012131415[[#This Row],[ID]],MusicalTheatre!A:B,2, FALSE)","v":"(716) Mary Anderson"},{"$f":"MusicalTheatre!U21","v":5},{"$f":"MusicalTheatre!S21","v":74},{"$f":"IF((Table71012131415[[#This Row],[Rank]]+Table71012131415[[#This Row],[Score]])>0,1,0)","v":1},4,22,1,25,1,25,{"$f":"SUM(F4,H4,J4)","v":6},{"$f":"SUM(G4,I4,K4)","v":72},"1st"]
[{"$f":"MusicalTheatre!A9","v":"B-601"},{"$f":"VLOOKUP(Table71012131415[[#This Row],[ID]],MusicalTheatre!A:B,2, FALSE)","v":"(700) Courtney Houston"},{"$f":"MusicalTheatre!U9","v":5},{"$f":"MusicalTheatre!S9","v":68},{"$f":"IF((Table71012131415[[#This Row],[Rank]]+Table71012131415[[#This Row],[Score]])>0,1,0)","v":1},6,20,6,24,5,21,{"$f":"SUM(F5,H5,J5)","v":17},{"$f":"SUM(G5,I5,K5)","v":65}]
[{"$f":"MusicalTheatre!A11","v":"B-603"},{"$f":"VLOOKUP(Table71012131415[[#This Row],[ID]],MusicalTheatre!A:B,2, FALSE)","v":"(702) Jaren Henrie"},{"$f":"MusicalTheatre!U11","v":6},{"$f":"MusicalTheatre!S11","v":69},{"$f":"IF((Table71012131415[[#This Row],[Rank]]+Table71012131415[[#This Row],[Score]])>0,1,0)","v":1},3,23,4,24,3,23,{"$f":"SUM(F6,H6,J6)","v":10},{"$f":"SUM(G6,I6,K6)","v":70}]
{"$rows_left_out":117}
{"sheet":"One-Acts","index":13,"n_rows":33,"n_cols":35,"rows_kept":33,"cut":false,"hidden":false,"merged":[[0,0,0,8]]}
["ONE-ACTS",null,null,null,null,null,null,null,null,null,"Rank 1-4",null,null,null,null,null,null,null,null,null,null,null,null,null,null,null,null,null,null,"S","E","G","F",null,"1violation"]
[null,null,null,null,null,null,null,null,null,null,"Judge 1",null,"Judge 2",null,"Judge 3"]
[null,"Title of Piece",null,null,null,null,null,null,null,null,"J1 rank","J1 score","J2 rank","J2 score","J3 rank","J3 score",null,null,"TOTAL RANK",null,"TOTAL SCORE",null,"TOTAL SCHOOL SWEEPS POINTS",null,null,"Time Violations"]
["A-701",null,null,null,null,null,null,"\"Bad Auditions by Bad Actors\" DRA",null,null,4,42,2,38,1,48,null,null,{"$f":"SUM(K4,M4,O4)","v":7},null,{"$f":"SUM(L4,N4,P4)","v":128},null,{"$f":"SUM(U4,AA4)","v":128},null,null,null,{"$f":"IF(Z4=\"1violation\",-35*1,IF(Z4=\"2violations\",-35*2,IF(Z4=\"3violations\",-35*3,IF(Z4=\"\",\"\"))))","v":""},"2nd"]
["B-701",null,null,null,null,null,null,"\"Help Desk\" Panquitch",null,null,2,43,1,44,2,45,null,null,5,null,132,null,132,null,null,null,{"$f":"IF(Z5=\"1violation\",-10*1,IF(Z5=\"2violations\",-10*2,IF(Z5=\"3violations\",-10*3,IF(Z5=\"\",\"\"))))","v":""},"1st"]
["C-701",null,null,null,null,null,null,null,null,null,null,null,null,null,null,null,null,null,0,null,0,null,0,null,null,null,""]
{"$rows_left_out":28}
{"sheet":"Sweepstakes","index":14,"n_rows":33,"n_cols":23,"rows_kept":33,"cut":false,"hidden":false,"merged":[]}
["FINAL SWEEPSTAKES SCORES"]
[]
[null,"School Name",null,"HUMOROUS MONOLOGUES",null,null,"DRAMATIC MONOLOGUES",null,null,"CLASSICAL SCENES",null,null,"CONTEMPORARY SCENES",null,null,"PANTOMIMES",null,"MUSICAL THEATRE",null,null,"ONE-ACT",null,"TOTAL"]
["A","Diamond Ranch",null,null,{"$f":"SUM('Humorous Monologues'!Y4)","v":199},null,null,{"$f":"SUM(Dramatic!Y4)","v":204},null,null,{"$f":"SUM(Classical!Y4)","v":185},null,null,{"$f":"SUM(Contemporary!Y4)","v":186},null,{"$f":"SUM(Pantomime!Y4)","v":203},null,{"$f":"SUM(MusicalTheatre!Y4)","v":200},null,null,{"$f":"'One-Acts'!W4","v":128},null,{"$f":"SUM(E4:U4)","v":1305}]
["B","Panguitch",null,null,{"$f":"SUM('Humorous Monologues'!Y9)","v":140},null,null,{"$f":"SUM(Dramatic!Y9)","v":212},null,null,{"$f":"SUM(Classical!Y9)","v":73},null,null,{"$f":"SUM(Contemporary!Y9)","v":121},null,{"$f":"SUM(Pantomime!Y9)","v":58},null,{"$f":"SUM(MusicalTheatre!Y9)","v":212},null,null,{"$f":"'One-Acts'!W5","v":132},null,948]
["C","Wayne",null,null,{"$f":"SUM('Humorous Monologues'!Y14)","v":164},null,null,{"$f":"SUM(Dramatic!Y14)","v":0},null,null,{"$f":"SUM(Classical!Y14)","v":0},null,null,{"$f":"SUM(Contemporary!Y14)","v":0},null,{"$f":"SUM(Pantomime!Y14)","v":70},null,{"$f":"SUM(MusicalTheatre!Y14)","v":196},null,null,{"$f":"'One-Acts'!W6","v":0},null,430]
{"$rows_left_out":27}